Reaction Details
TargetCoagulation factor VII
LigandBDBM14593
Substrate/CompetitorBDBM14496
Meas. Tech.TF-VIIa Assay
IC50 16±n/a nM
Citation Parlow, JJCase, BLDice, TAFenton, RLHayes, MJJones, DENeumann, WLWood, RSLachance, RMGirard, TJNicholson, NSClare, MStegeman, RAStevens, AMStallings, WCKurumbail, RGSouth, MS Design, parallel synthesis, and crystal structures of pyrazinone antithrombotics as selective inhibitors of the tissue factor VIIa complex. J Med Chem46:4050-62 (2003) 
 
Coagulation factor VII
Name:Coagulation factor VII
Type:Enzyme
Mol. Mass.:51599.89
Organism:Homo sapiens (Human)
Description:n/a
Residue:466
BDBM14593
BDBM14496
NameBDBM14593
Synonyms:3-amino-5-[1-({[(4-carbamimidoylphenyl)methyl]carbamoyl}methyl)-3-chloro-6-oxo-5-(propan-2-ylamino)-1,6-dihydropyrazin-2-yl]benzoic acid Pyrazinone Analog 34
TypeSmall organic molecule
Emp. Form.C24H26ClN7O4
Mol. Mass.511.961
SMILESCC(C)Nc1nc(Cl)c(-c2cc(N)cc(c2)C(O)=O)n(CC(=O)NCc2ccc(cc2)C(N)=N)c1=O