Reaction Details
TargetProthrombin
LigandBDBM14498
Substrate/CompetitorBDBM12678
Meas. Tech.TF-VIIa Assay
IC50 160±n/a nM
Citation Parlow, JJCase, BLDice, TAFenton, RLHayes, MJJones, DENeumann, WLWood, RSLachance, RMGirard, TJNicholson, NSClare, MStegeman, RAStevens, AMStallings, WCKurumbail, RGSouth, MS Design, parallel synthesis, and crystal structures of pyrazinone antithrombotics as selective inhibitors of the tissue factor VIIa complex. J Med Chem46:4050-62 (2003) 
 
Prothrombin
Name:Prothrombin
Type:Protein
Mol. Mass.:70029.57
Organism:Homo sapiens (Human)
Description:P00734
Residue:622
BDBM14498
BDBM12678
NameBDBM14498
Synonyms:CHEMBL75084 Pyrazinone Analog 24a
TypeSmall organic molecule
Emp. Form.C28H27ClN6O2
Mol. Mass.515.006
SMILESNC(=N)c1ccc(CNC(=O)Cn2c(c(Cl)nc(NCCc3ccccc3)c2=O)-c2ccccc2)cc1