Reaction Details
TargetProthrombin
LigandBDBM14501
Substrate/CompetitorBDBM12678
Meas. Tech.TF-VIIa Assay
IC50 150±n/a nM
Citation Parlow, JJCase, BLDice, TAFenton, RLHayes, MJJones, DENeumann, WLWood, RSLachance, RMGirard, TJNicholson, NSClare, MStegeman, RAStevens, AMStallings, WCKurumbail, RGSouth, MS Design, parallel synthesis, and crystal structures of pyrazinone antithrombotics as selective inhibitors of the tissue factor VIIa complex. J Med Chem46:4050-62 (2003) 
 
Prothrombin
Name:Prothrombin
Type:Protein
Mol. Mass.:70029.57
Organism:Homo sapiens (Human)
Description:P00734
Residue:622
BDBM14501
BDBM12678
NameBDBM14501
Synonyms:N-[(6-carbamimidoylpyridin-3-yl)methyl]-2-{2-oxo-6-phenyl-3-[(2-phenylethyl)amino]-1,2-dihydropyrazin-1-yl}acetamide | Pyrazinone Analog 24d
TypeSmall organic molecule
Emp. Form.C27H27N7O2
Mol. Mass.481.549
SMILESNC(=N)c1ccc(CNC(=O)Cn2c(cnc(NCCc3ccccc3)c2=O)-c2ccccc2)cn1