Reaction Details
TargetProthrombin
LigandBDBM14520
Substrate/CompetitorBDBM12678
Meas. Tech.TF-VIIa Assay
IC50<40±n/a nM
Citation Parlow, JJCase, BLDice, TAFenton, RLHayes, MJJones, DENeumann, WLWood, RSLachance, RMGirard, TJNicholson, NSClare, MStegeman, RAStevens, AMStallings, WCKurumbail, RGSouth, MS Design, parallel synthesis, and crystal structures of pyrazinone antithrombotics as selective inhibitors of the tissue factor VIIa complex. J Med Chem46:4050-62 (2003) 
 
Prothrombin
Name:Prothrombin
Type:Protein
Mol. Mass.:70029.57
Organism:Homo sapiens (Human)
Description:P00734
Residue:622
BDBM14520
BDBM12678
NameBDBM14520
Synonyms:N-[(4-carbamimidoylphenyl)methyl]-2-(5-chloro-3-{[2-(3-chlorophenyl)ethyl]amino}-2-oxo-6-phenyl-1,2-dihydropyrazin-1-yl)acetamide | Pyrazinone Analog 26g
TypeSmall organic molecule
Emp. Form.C28H26Cl2N6O2
Mol. Mass.549.451
SMILESNC(=N)c1ccc(CNC(=O)Cn2c(c(Cl)nc(NCCc3cccc(Cl)c3)c2=O)-c2ccccc2)cc1