Reaction Details
TargetRetinol-binding protein 4
LigandBDBM249469
Substrate/Competitorn/a
Meas. Tech.Scintillation Proximity Binding Assay
IC50<1.37±n/a nM
Citation Petrukhin, KCioffi, CJohnson, GAllikmets, RFreeman, EChen, PConlon, MZhu, L Substituted 4-phenylpiperidines, their preparation and use US Patent US9777010 Publication Date 10/3/2017
 
Retinol-binding protein 4
Name:Retinol-binding protein 4
Type:Protein
Mol. Mass.:23008.75
Organism:Homo sapiens (Human)
Description:P02753
Residue:201
BDBM249469
NameBDBM249469
Synonyms:US10072016, Compound 68 US10913746, Compound 68 US9434727, 68 | US9777010, Compound 68
TypeSmall organic molecule
Emp. Form.C21H22F4N4O3
Mol. Mass.454.418
SMILESCOC(=O)N1CCc2[nH]nc(C(=O)N3CCC(CC3)c3cccc(F)c3C(F)(F)F)c2C1