Reaction Details
TargetRetinol-binding protein 4
LigandBDBM249554
Substrate/Competitorn/a
Meas. Tech.Scintillation Proximity Binding Assay
IC50 3.10±n/a nM
Citation Petrukhin, KCioffi, CJohnson, GAllikmets, RFreeman, EChen, PConlon, MZhu, L Substituted 4-phenylpiperidines, their preparation and use US Patent US9777010 Publication Date 10/3/2017
 
Retinol-binding protein 4
Name:Retinol-binding protein 4
Type:Protein
Mol. Mass.:23008.75
Organism:Homo sapiens (Human)
Description:P02753
Residue:201
BDBM249554
NameBDBM249554
Synonyms:US10072016, Compound 152 US10913746, Compound 152 US9434727, 152 | US9777010, Compound 152
TypeSmall organic molecule
Emp. Form.C19H15ClFN5O
Mol. Mass.383.807
SMILESFc1cccc(C2CCN(CC2)C(=O)c2nnc3ccc(cn23)C#N)c1Cl