Reaction Details
TargetHigh affinity nerve growth factor receptor
LigandBDBM344281
Substrate/Competitorn/a
IC50 4.70±n/a nM
Citation Altenbach, RJLiu, HClapham, BAguirre, ALCowart, MKoenig, JRSarris, KScanio, MJSwinger, KKVasudevan, AVillamil, CIWoller, KR Furo-3-carboxamide derivatives and methods of use US Patent US9777020 Publication Date 10/3/2017
 
High affinity nerve growth factor receptor
Name:High affinity nerve growth factor receptor
Type:n/a
Mol. Mass.:87498.18
Organism:Homo sapiens (Human)
Description:P04629
Residue:796
BDBM344281
NameBDBM344281
Synonyms:N-[6-(4-acetylpiperazin-1-yl)-2-ethoxypyridin-3-yl]-5-(2-methoxyethyl)-6,6-dimethyl-4-oxo-4,5,6,7-tetrahydrofuro[3,2-c]pyridine-3-carboxamide | US9777020, Example 175
TypeSmall organic molecule
Emp. Form.C26H35N5O6
Mol. Mass.513.586
SMILESCCOc1nc(ccc1NC(=O)c1coc2CC(C)(C)N(CCOC)C(=O)c12)N1CCN(CC1)C(C)=O