Reaction Details
TargetHigh affinity nerve growth factor receptor
LigandBDBM127634
Substrate/Competitorn/a
Meas. Tech.TrkA ELISA Assay
IC50 0.450±n/a nM
Citation Allen, SAndrews, SWCondroski, KRHaas, JHuang, LJiang, YKercher, TSeo, J Substituted pyrazolo[1,5-a]pyrimidine compounds as Trk kinase inhibitors US Patent US9782415 Publication Date 10/10/2017
 
High affinity nerve growth factor receptor
Name:High affinity nerve growth factor receptor
Type:n/a
Mol. Mass.:87498.18
Organism:Homo sapiens (Human)
Description:P04629
Residue:796
BDBM127634
NameBDBM127634
Synonyms:US10251889, Example 7 US8791123, 7 US9796724, Example 7
TypeSmall organic molecule
Emp. Form.C23H25F2N5O2
Mol. Mass.441.4737
SMILESO[C@H]1CC[C@@H](CC1)NC(=O)c1cnn2ccc(nc12)N1CCC[C@@H]1c1cc(F)ccc1F