Reaction Details
TargetHistone deacetylase 4
LigandBDBM344298
Substrate/Competitorn/a
Meas. Tech.Inhibition Assay
IC50 50.0±n/a nM
Citation Dominguez, CMuñoz-Sanjuán, IMaillard, MRaphy, GHaughan, AFLuckhurst, CAJarvis, REBürli, RWBreccia, PWishart, GHughes, SJAllen, DRPenrose, SD Histone deacetylase inhibitors and compositions and methods of use thereof US Patent US9783488 Publication Date 10/10/2017
 
Histone deacetylase 4
Name:Histone deacetylase 4
Type:Enzyme
Mol. Mass.:119049.39
Organism:Homo sapiens (Human)
Description:P56524
Residue:1084
BDBM344298
NameBDBM344298
Synonyms:(1R*,3R*)-1-(3-Fluoro-2- methylphenyl)-N-hydroxy- 3- phenylcyclopentanecarboxamide | US9783488, Example 7
TypeSmall organic molecule
Emp. Form.C19H20FNO2
Mol. Mass.313.366
SMILESCc1c(F)cccc1[C@]1(CC[C@H](C1)c1ccccc1)C(=O)NO