Reaction Details
TargetNitric oxide synthase, brain
LigandBDBM344416
Substrate/Competitorn/a
Meas. Tech.Enzyme Assay
Ki 24.0±n/a nM
Citation Silverman, RBCinelli, MAPensa, AV 2-aminoquinoline-based compounds for potent and selective neuronal nitric oxide synthase inhibition US Patent US9783500 Publication Date 10/10/2017
 
Nitric oxide synthase, brain
Name:Nitric oxide synthase, brain
Type:Enzyme
Mol. Mass.:160570.98
Organism:Rattus norvegicus (rat)
Description:Recombinant nNOS overexpressed in E. coli was used in enzyme assays.
Residue:1429
BDBM344416
NameBDBM344416
Synonyms:US9783500, Compound 11
TypeSmall organic molecule
Emp. Form.C18H19N3O
Mol. Mass.293.363
SMILESCN(C)c1cccc(OCc2ccc3ccc(N)nc3c2)c1