Reaction Details
TargetKallikrein-1
LigandBDBM345056
Substrate/Competitorn/a
Meas. Tech.Kallikrein Assay
IC50 83.1±n/a nM
Citation Liu, WEdmondson, SDGuo, ZMertz, EOgawa, AKSo, SSun, WBrockunier, LLAli, AKuang, RWu, H Factor Xla inhibitors US Patent US9783530 Publication Date 10/10/2017
 
Kallikrein-1
Name:Kallikrein-1
Type:Enzyme
Mol. Mass.:28874.69
Organism:Homo sapiens (Human)
Description:P06870
Residue:262
BDBM345056
NameBDBM345056
Synonyms:4-{[(2S)-2-{5-[5-chloro- 2-(1H-tetrazol-1- yl)phenyl]-1- oxidopyridin-2-yl}-3- phenylpropanoyl]amino} benzoic acid | US9783530, 1
TypeSmall organic molecule
Emp. Form.C28H21ClN6O4
Mol. Mass.540.957
SMILESOC(=O)c1ccc(NC(=O)[C@@H](Cc2ccccc2)c2ccc(c[n+]2[O-])-c2cc(Cl)ccc2-n2cnnn2)cc1