Reaction Details
TargetKallikrein-1
LigandBDBM345078
Substrate/Competitorn/a
Meas. Tech.Kallikrein Assay
IC50 0.700±n/a nM
Citation Liu, WEdmondson, SDGuo, ZMertz, EOgawa, AKSo, SSun, WBrockunier, LLAli, AKuang, RWu, H Factor Xla inhibitors US Patent US9783530 Publication Date 10/10/2017
 
Kallikrein-1
Name:Kallikrein-1
Type:Enzyme
Mol. Mass.:28874.69
Organism:Homo sapiens (Human)
Description:P06870
Residue:262
BDBM345078
NameBDBM345078
Synonyms:2-(1-((4-Carboxyphenyl)amino)-1-oxo-3-phenylpropan-2-yl)-5-(5-chloro-2-cyanophenyl)-4-methoxypyridine 1-oxide (Examples 23 and 24) US9783530, 24
TypeSmall organic molecule
Emp. Form.C29H22ClN3O5
Mol. Mass.527.955
SMILESCOc1cc(C(Cc2ccccc2)C(=O)Nc2ccc(cc2)C(O)=O)[n+]([O-])cc1-c1cc(Cl)ccc1C#N