Reaction Details
TargetKallikrein-1
LigandBDBM345093
Substrate/Competitorn/a
Meas. Tech.Kallikrein Assay
IC50 830±n/a nM
Citation Liu, WEdmondson, SDGuo, ZMertz, EOgawa, AKSo, SSun, WBrockunier, LLAli, AKuang, RWu, H Factor Xla inhibitors US Patent US9783530 Publication Date 10/10/2017
 
Kallikrein-1
Name:Kallikrein-1
Type:Enzyme
Mol. Mass.:28874.69
Organism:Homo sapiens (Human)
Description:P06870
Residue:262
BDBM345093
NameBDBM345093
Synonyms:4-[(2-{5-[5-chloro-2- (trifluoromethoxy)phenyl]- 1-oxidopyridin-2-yl}-3- cyclopropylpropanoyl) amino]benzoic acid US9783530, 39
TypeSmall organic molecule
Emp. Form.C25H20ClF3N2O5
Mol. Mass.520.885
SMILESOC(=O)c1ccc(NC(=O)C(CC2CC2)c2ccc(c[n+]2[O-])-c2cc(Cl)ccc2OC(F)(F)F)cc1