Reaction Details
TargetKallikrein-1
LigandBDBM345099
Substrate/Competitorn/a
Meas. Tech.Kallikrein Assay
IC50 17.6±n/a nM
Citation Liu, WEdmondson, SDGuo, ZMertz, EOgawa, AKSo, SSun, WBrockunier, LLAli, AKuang, RWu, H Factor Xla inhibitors US Patent US9783530 Publication Date 10/10/2017
 
Kallikrein-1
Name:Kallikrein-1
Type:Enzyme
Mol. Mass.:28874.69
Organism:Homo sapiens (Human)
Description:P06870
Residue:262
BDBM345099
NameBDBM345099
Synonyms:4-[(2-{5-[5-chloro-2-(1H- tetrazol-1-yl)phenyl]-1- oxidopyridin-2-yl}-3- cyclopropylpropanoyl) amino]-2-fluorobenzoic acid US9783530, 45
TypeSmall organic molecule
Emp. Form.C25H20ClFN6O4
Mol. Mass.522.916
SMILESOC(=O)c1ccc(NC(=O)C(CC2CC2)c2ccc(c[n+]2[O-])-c2cc(Cl)ccc2-n2cnnn2)cc1F