Reaction Details
TargetDihydroorotate dehydrogenase (quinone), mitochondrial
LigandBDBM14710
Substrate/CompetitorBDBM14700
Meas. Tech.DHODH Inhibition Assay
pH8±n/a
Temperature298.15±n/a K
Ki 20±n/a nM
IC50 180±90 nM
Km13400±n/a nM
Citation Heikkila, TRamsey, CDavies, MGaltier, CStead, AMJohnson, APFishwick, CWBoa, ANMcConkey, GA Design and synthesis of potent inhibitors of the malaria parasite dihydroorotate dehydrogenase. J Med Chem50:186-91 (2007) 
 
Dihydroorotate dehydrogenase (quinone), mitochondrial
Name:Dihydroorotate dehydrogenase (quinone), mitochondrial
Type:Enzyme
Mol. Mass.:65581.88
Organism:Plasmodium falciparum (isolate 3D7)
Description:Q08210
Residue:569
BDBM14710
BDBM14700
NameBDBM14710
Synonyms:ChemBridge compound no. 2 N-(4-bromo-2-methylphenyl)naphthalene-2-carboxamide | naphthamide compound 2
TypeSmall organic molecule
Emp. Form.C18H14BrNO
Mol. Mass.340.214
SMILESCc1cc(Br)ccc1NC(=O)c1ccc2ccccc2c1