Reaction Details
TargetTissue-type plasminogen activator
LigandBDBM14714
Substrate/CompetitorBDBM14715
Meas. Tech.Serine Protease Inhibition Assay
pH7.8±n/a
Temperature295.15±n/a K
Ki>3900±n/a nM
Citation Olivero, AGEigenbrot, CGoldsmith, RRobarge, KArtis, DRFlygare, JRawson, TSutherlin, DPKadkhodayan, SBeresini, MElliott, LODeGuzman, GGBanner, DWUltsch, MMarzec, UHanson, SRRefino, CBunting, SKirchhofer, D A selective, slow binding inhibitor of factor VIIa binds to a nonstandard active site conformation and attenuates thrombus formation in vivo. J Biol Chem280:9160-9 (2005) 
 
Tissue-type plasminogen activator
Name:Tissue-type plasminogen activator
Type:Enzyme
Mol. Mass.:62931.08
Organism:Homo sapiens (Human)
Description:n/a
Residue:562
BDBM14714
BDBM14715
NameBDBM14714
Synonyms:(2R)-N-[(3-aminobenzene)sulfonyl]-2-[(4-carbamimidoyl-3-hydroxyphenyl)amino]-2-(3,5-diethoxy-2-fluorophenyl)acetamide R-4-[2-(3-aminobenzenesulfonylamino)-1-(3,5-diethoxy-2-fluorophenyl)-2-oxoethylamino]-2-hydroxy-benzamidine.TFA
TypeSmall organic molecule
Emp. Form.C25H28FN5O6S
Mol. Mass.545.583
SMILESCCOc1cc(OCC)c(F)c(c1)[C@@H](Nc1ccc(C(N)=N)c(O)c1)C(=O)NS(=O)(=O)c1cccc(N)c1