Reaction Details
TargetCarbonic anhydrase 1
LigandBDBM14735
Substrate/CompetitorBDBM11326
Meas. Tech.Esterase Assay
pH7.5±n/a
Temperature298.15±n/a K
Ki 5±n/a nM
Citation Casey, JRMorgan, PEVullo, DScozzafava, AMastrolorenzo, ASupuran, CT Carbonic anhydrase inhibitors. Design of selective, membrane-impermeant inhibitors targeting the human tumor-associated isozyme IX. J Med Chem47:2337-47 (2004) 
 
Carbonic anhydrase 1
Name:Carbonic anhydrase 1
Type:Enzyme
Mol. Mass.:28873.37
Organism:Homo sapiens (Human)
Description:P00915
Residue:261
BDBM14735
BDBM11326
NameBDBM14735
Synonyms:1-N-[5-Sulfamoyl-1,3,4-thiadiazol-2-yl-(aminosulfonyl-4-phenyl)]-2,6-diphenyl pyridinium perchlorate pyridinium-containing sulfonamide analog 14s
TypeSmall organic molecule
Emp. Form.C25H20N5O4S3
Mol. Mass.550.652
SMILESNS(=O)(=O)c1nnc(NS(=O)(=O)c2ccc(cc2)-[n+]2c(cccc2-c2ccccc2)-c2ccccc2)s1