Reaction Details
TargetCarbonic anhydrase 4
LigandBDBM14718
Substrate/CompetitorBDBM11326
Meas. Tech.Esterase Assay
Ki 2.1±n/a nM
Citation Casey, JRMorgan, PEVullo, DScozzafava, AMastrolorenzo, ASupuran, CT Carbonic anhydrase inhibitors. Design of selective, membrane-impermeant inhibitors targeting the human tumor-associated isozyme IX. J Med Chem47:2337-47 (2004) 
 
Carbonic anhydrase 4
Name:Carbonic anhydrase 4
Type:Enzyme
Mol. Mass.:35152.74
Organism:Bos taurus (bovine)
Description:Bovine isozyme, isolated from lung microsomes
Residue:312
BDBM14718
BDBM11326
NameBDBM14718
Synonyms:1-N-[5-Sulfamoyl-1,3,4-thiadiazol-2-yl-(aminosulfonyl-4-phenyl)]-2,4,6-trimethylpyridinium perchlorate pyridinium-containing sulfonamide analog 14a
TypeSmall organic molecule
Emp. Form.C16H18N5O4S3
Mol. Mass.440.54
SMILESCc1cc(C)[n+](c(C)c1)-c1ccc(cc1)S(=O)(=O)Nc1nnc(s1)S(N)(=O)=O