Reaction Details
TargetCarbonic anhydrase 4
LigandBDBM14734
Substrate/CompetitorBDBM11326
Meas. Tech.Esterase Assay
Ki 5.6±n/a nM
Citation Casey, JRMorgan, PEVullo, DScozzafava, AMastrolorenzo, ASupuran, CT Carbonic anhydrase inhibitors. Design of selective, membrane-impermeant inhibitors targeting the human tumor-associated isozyme IX. J Med Chem47:2337-47 (2004) 
 
Carbonic anhydrase 4
Name:Carbonic anhydrase 4
Type:Enzyme
Mol. Mass.:35152.74
Organism:Bos taurus (bovine)
Description:Bovine isozyme, isolated from lung microsomes
Residue:312
BDBM14734
BDBM11326
NameBDBM14734
Synonyms:1-N-[5-Sulfamoyl-1,3,4-thiadiazol-2-yl-(aminosulfonyl-4-phenyl)]-2,4,6-triphenylpyridinium perchlorate pyridinium-containing sulfonamide analog 14r
TypeSmall organic molecule
Emp. Form.C31H24N5O4S3
Mol. Mass.626.748
SMILESNS(=O)(=O)c1nnc(NS(=O)(=O)c2ccc(cc2)-[n+]2c(cc(cc2-c2ccccc2)-c2ccccc2)-c2ccccc2)s1