Reaction Details
TargetCarbonic anhydrase 9
LigandBDBM14719
Substrate/CompetitorBDBM10856
Meas. Tech.Esterase Assay
Ki 5±n/a nM
Citation Casey, JRMorgan, PEVullo, DScozzafava, AMastrolorenzo, ASupuran, CT Carbonic anhydrase inhibitors. Design of selective, membrane-impermeant inhibitors targeting the human tumor-associated isozyme IX. J Med Chem47:2337-47 (2004) 
 
Carbonic anhydrase 9
Name:Carbonic anhydrase 9
Type:Enzyme
Mol. Mass.:49669.03
Organism:Homo sapiens (Human)
Description:Catalytic domain of human cloned isozyme was used in the assay
Residue:459
BDBM14719
BDBM10856
NameBDBM14719
Synonyms:1-N-[5-Sulfamoyl-1,3,4-thiadiazol-2-yl-(aminosulfonyl-4-phenyl)]-2-isopropyl-4,6-dimethylpyridinium perchlorate pyridinium-containing sulfonamide analog 14b
TypeSmall organic molecule
Emp. Form.C18H22N5O4S3
Mol. Mass.468.593
SMILESCC(C)c1cc(C)cc(C)[n+]1-c1ccc(cc1)S(=O)(=O)Nc1nnc(s1)S(N)(=O)=O