Reaction Details
TargetMonocarboxylate transporter 4
LigandBDBM345259
Substrate/Competitorn/a
Meas. Tech.Assay 2: MCT4-Mediated Lactate Transport in NCI-H358 Lung Adenocarcinoma Cells
IC50 63.0±n/a nM
Citation Parnell, KMMcCall, J MCT4 inhibitors for treating disease US Patent US10202350 Publication Date 2/12/2019
 
Monocarboxylate transporter 4
Name:Monocarboxylate transporter 4
Type:PROTEIN
Mol. Mass.:49474.36
Organism:Homo sapiens (Human)
Description:ChEMBL_104604
Residue:465
BDBM345259
NameBDBM345259
Synonyms:2-[[5-(4-Chlorophenyl)-1-[(2,4- dichlorophenyl)methyl]pyrazol-3- yl]methoxy]-2-methyl-propanoic acid 1H NMR (CD3OD, 400 MHz) $#948; 1.48 (s, 6H), 4.58 (s, 2H), 5.40 (s, 2H), 6.54 (s, 1H), 6.73 (d, 1H), 7.20-7.38 (m, 3H), 7.40-48 (m, 3H). US10214492, Example 5 US11724989, Example 5
TypeSmall organic molecule
Emp. Form.C21H19Cl3N2O3
Mol. Mass.453.746
SMILESCC(C)(OCc1cc(-c2ccc(Cl)cc2)n(Cc2ccc(Cl)cc2Cl)n1)C(O)=O