Reaction Details
TargetMonocarboxylate transporter 4
LigandBDBM345299
Substrate/Competitorn/a
Meas. Tech.Assay 3: MCT4-Mediated Lactate Transport in MDA-MB-231 Breast Cancer Cells
IC50 19.0±n/a nM
Citation Parnell, KMMcCall, J MCT4 inhibitors for treating disease US Patent US10202350 Publication Date 2/12/2019
 
Monocarboxylate transporter 4
Name:Monocarboxylate transporter 4
Type:PROTEIN
Mol. Mass.:49474.36
Organism:Homo sapiens (Human)
Description:ChEMBL_104604
Residue:465
BDBM345299
NameBDBM345299
Synonyms:2-[[1-[(2-Chlorophenyl)methyl]-5-[3- (tetrahydropyran-4- ylmethoxy)phenyl]pyrazol-3-yl]methoxy]- 2-methyl-propanoic acid. 1HNMR (CDCl3): $#948; 1.34-1.41 (m, 2H), 1.55 (s, 6H), 1.66-1.69 (m, 2H), 1.97- 1.99 (m, 1H), 3.38-3.46m, 2H), 3.56 (d, 2H), 3.98-4.01 (m, 2H), 4.62 (s, 2H), 5.42 (s, 2H), 6.42 (s, 1H), 6.71 (s, 1H), 6.77-6.95 (m, 3H), 7.19-7.35 (m, 4H). US10214492, Example 45 US11724989, Example 45
TypeSmall organic molecule
Emp. Form.C27H31ClN2O5
Mol. Mass.498.998
SMILESCC(C)(OCc1cc(-c2cccc(OCC3CCOCC3)c2)n(Cc2ccccc2Cl)n1)C(O)=O