Reaction Details
TargetLysine-specific demethylase 2B
LigandBDBM345336
Substrate/Competitorn/a
Meas. Tech.KDM2B TR-FRET Assay
IC50 0.053±n/a nM
Citation Albrecht, BKCote, AGehling, VHsiao-Wei Tsui, VKiefer, JRLiang, JMagnuson, SNasveschuk, CGRomero, FATaylor, AM Therapeutic compounds and uses thereof US Patent US10202354 Publication Date 2/12/2019
 
Lysine-specific demethylase 2B
Name:Lysine-specific demethylase 2B
Type:Enzyme Catalytic Domain
Mol. Mass.:152658.35
Organism:Homo sapiens (Human)
Description:Q8NHM5
Residue:1336
BDBM345336
NameBDBM345336
Synonyms:2-[4-[[2-(4-cyclobutylpiperazin-1-yl)-4,5-dihydroimidazol-1-yl]sulfonyl]phenyl]benzonitrile | US10202354, Example 1
TypeSmall organic molecule
Emp. Form.C24H27N5O2S
Mol. Mass.449.568
SMILESO=S(=O)(N1CCN=C1N1CCN(CC1)C1CCC1)c1ccc(cc1)-c1ccccc1C#N