Reaction Details
TargetLysine-specific demethylase 2B
LigandBDBM345354
Substrate/Competitorn/a
Meas. Tech.KDM2B TR-FRET Assay
IC50 0.027±n/a nM
Citation Albrecht, BKCote, AGehling, VHsiao-Wei Tsui, VKiefer, JRLiang, JMagnuson, SNasveschuk, CGRomero, FATaylor, AM Therapeutic compounds and uses thereof US Patent US10202354 Publication Date 2/12/2019
 
Lysine-specific demethylase 2B
Name:Lysine-specific demethylase 2B
Type:Enzyme Catalytic Domain
Mol. Mass.:152658.35
Organism:Homo sapiens (Human)
Description:Q8NHM5
Residue:1336
BDBM345354
NameBDBM345354
Synonyms:1-cyclobutyl-4-[1-[4-(2-thienyl)phenyl]sulfonyl-4,5-dihydroimidazol-2-yl]piperazine | US10202354, Example 19
TypeSmall organic molecule
Emp. Form.C21H26N4O2S2
Mol. Mass.430.587
SMILESO=S(=O)(N1CCN=C1N1CCN(CC1)C1CCC1)c1ccc(cc1)-c1cccs1