Reaction Details
TargetLysine-specific demethylase 2B
LigandBDBM345377
Substrate/Competitorn/a
Meas. Tech.KDM2B TR-FRET Assay
IC50 0.047±n/a nM
Citation Albrecht, BKCote, AGehling, VHsiao-Wei Tsui, VKiefer, JRLiang, JMagnuson, SNasveschuk, CGRomero, FATaylor, AM Therapeutic compounds and uses thereof US Patent US10202354 Publication Date 2/12/2019
 
Lysine-specific demethylase 2B
Name:Lysine-specific demethylase 2B
Type:Enzyme Catalytic Domain
Mol. Mass.:152658.35
Organism:Homo sapiens (Human)
Description:Q8NHM5
Residue:1336
BDBM345377
NameBDBM345377
Synonyms:US10202354, Example 42
TypeSmall organic molecule
Emp. Form.C23H34N4O2S
Mol. Mass.430.607
SMILESCC(C)c1ccc(cc1)S(=O)(=O)N1C[C@@H](N=C1N1CCN(CC1)C1CCC1)C1CC1