Reaction Details
TargetLysine-specific demethylase 2B
LigandBDBM345380
Substrate/Competitorn/a
Meas. Tech.KDM2B TR-FRET Assay
IC50 0.049±n/a nM
Citation Albrecht, BKCote, AGehling, VHsiao-Wei Tsui, VKiefer, JRLiang, JMagnuson, SNasveschuk, CGRomero, FATaylor, AM Therapeutic compounds and uses thereof US Patent US10202354 Publication Date 2/12/2019
 
Lysine-specific demethylase 2B
Name:Lysine-specific demethylase 2B
Type:Enzyme Catalytic Domain
Mol. Mass.:152658.35
Organism:Homo sapiens (Human)
Description:Q8NHM5
Residue:1336
BDBM345380
NameBDBM345380
Synonyms:2-(4-cyclobutylpiperazin-1-yl)-3-(4-isopropylphenyl)sulfonyl-1,3-diazaspiro[4.4]non-1-ene | US10202354, Example 45
TypeSmall organic molecule
Emp. Form.C24H36N4O2S
Mol. Mass.444.633
SMILESCC(C)c1ccc(cc1)S(=O)(=O)N1CC2(CCCC2)N=C1N1CCN(CC1)C1CCC1