Reaction Details
TargetLysine-specific demethylase 2B
LigandBDBM345388
Substrate/Competitorn/a
Meas. Tech.KDM2B TR-FRET Assay
IC50 0.081±n/a nM
Citation Albrecht, BKCote, AGehling, VHsiao-Wei Tsui, VKiefer, JRLiang, JMagnuson, SNasveschuk, CGRomero, FATaylor, AM Therapeutic compounds and uses thereof US Patent US10202354 Publication Date 2/12/2019
 
Lysine-specific demethylase 2B
Name:Lysine-specific demethylase 2B
Type:Enzyme Catalytic Domain
Mol. Mass.:152658.35
Organism:Homo sapiens (Human)
Description:Q8NHM5
Residue:1336
BDBM345388
NameBDBM345388
Synonyms:1-[4-tert-butylphenyl)sulfonyl-4,5-dihydroimidazol-2-yl]-4-cyclobutyl-piperazine | US10202354, Example 53
TypeSmall organic molecule
Emp. Form.C21H32N4O2S
Mol. Mass.404.569
SMILESCC(C)(C)c1ccc(cc1)S(=O)(=O)N1CCN=C1N1CCN(CC1)C1CCC1