Reaction Details
TargetLysine-specific demethylase 2B
LigandBDBM345400
Substrate/Competitorn/a
Meas. Tech.KDM2B TR-FRET Assay
IC50 0.050±n/a nM
Citation Albrecht, BKCote, AGehling, VHsiao-Wei Tsui, VKiefer, JRLiang, JMagnuson, SNasveschuk, CGRomero, FATaylor, AM Therapeutic compounds and uses thereof US Patent US10202354 Publication Date 2/12/2019
 
Lysine-specific demethylase 2B
Name:Lysine-specific demethylase 2B
Type:Enzyme Catalytic Domain
Mol. Mass.:152658.35
Organism:Homo sapiens (Human)
Description:Q8NHM5
Residue:1336
BDBM345400
NameBDBM345400
Synonyms:1-cyclobutyl-4-[1-(4-phenoxyphenyl)sulfonyl-4,5-dihydroimidazol-2-yl]piperazine | US10202354, Example 65
TypeSmall organic molecule
Emp. Form.C23H28N4O3S
Mol. Mass.440.558
SMILESO=S(=O)(N1CCN=C1N1CCN(CC1)C1CCC1)c1ccc(Oc2ccccc2)cc1