Reaction Details
TargetLysine-specific demethylase 2B
LigandBDBM345405
Substrate/Competitorn/a
Meas. Tech.KDM2B TR-FRET Assay
IC50 0.094±n/a nM
Citation Albrecht, BKCote, AGehling, VHsiao-Wei Tsui, VKiefer, JRLiang, JMagnuson, SNasveschuk, CGRomero, FATaylor, AM Therapeutic compounds and uses thereof US Patent US10202354 Publication Date 2/12/2019
 
Lysine-specific demethylase 2B
Name:Lysine-specific demethylase 2B
Type:Enzyme Catalytic Domain
Mol. Mass.:152658.35
Organism:Homo sapiens (Human)
Description:Q8NHM5
Residue:1336
BDBM345405
NameBDBM345405
Synonyms:N-[4-[[2-(4-cyclobutylpiperazin-1-yl)-4,5-dihydroimidazol-1-yl]sulfonyl]phenyl]acetamide | US10202354, Example 70
TypeSmall organic molecule
Emp. Form.C19H27N5O3S
Mol. Mass.405.514
SMILESCC(=O)Nc1ccc(cc1)S(=O)(=O)N1CCN=C1N1CCN(CC1)C1CCC1