Reaction Details
TargetcAMP and cAMP-inhibited cGMP 3',5'-cyclic phosphodiesterase 10A
LigandBDBM14742
Substrate/CompetitorBDBM10851
Meas. Tech.PDE Competitive Enzyme Inhibition Assay
pH7.5±n/a
Temperature295.15±n/a K
Ki 641±n/a nM
Citation Chappie, TAHumphrey, JMAllen, MPEstep, KGFox, CBLebel, LALiras, SMarr, ESMenniti, FSPandit, JSchmidt, CJTu, MWilliams, RDYang, FV Discovery of a series of 6,7-dimethoxy-4-pyrrolidylquinazoline PDE10A inhibitors. J Med Chem50:182-5 (2007) 
 
cAMP and cAMP-inhibited cGMP 3',5'-cyclic phosphodiesterase 10A
Name:cAMP and cAMP-inhibited cGMP 3',5'-cyclic phosphodiesterase 10A
Type:Enzyme
Mol. Mass.:90160.88
Organism:Rattus norvegicus (rat)
Description:PDE10A was generated from the full-length recombinant rat clone transfected into Sf9 cells.
Residue:794
BDBM14742
BDBM10851
NameBDBM14742
Synonyms:(S)-6,7-Dimethoxy-4-[3-(2-methoxy-phenoxy)-pyrrolidin-1-yl]-quinazoline 6,7-dimethoxy-4-[(3S)-3-(2-methoxyphenoxy)pyrrolidin-1-yl]quinazoline
TypeSmall organic molecule
Emp. Form.C21H23N3O4
Mol. Mass.381.425
SMILESCOc1ccccc1O[C@H]1CCN(C1)c1ncnc2cc(OC)c(OC)cc12