Reaction Details
TargetcAMP and cAMP-inhibited cGMP 3',5'-cyclic phosphodiesterase 10A
LigandBDBM14743
Substrate/CompetitorBDBM10851
Meas. Tech.PDE Competitive Enzyme Inhibition Assay
pH7.5±n/a
Temperature295.15±n/a K
Ki 198±n/a nM
Citation Chappie, TAHumphrey, JMAllen, MPEstep, KGFox, CBLebel, LALiras, SMarr, ESMenniti, FSPandit, JSchmidt, CJTu, MWilliams, RDYang, FV Discovery of a series of 6,7-dimethoxy-4-pyrrolidylquinazoline PDE10A inhibitors. J Med Chem50:182-5 (2007) 
 
cAMP and cAMP-inhibited cGMP 3',5'-cyclic phosphodiesterase 10A
Name:cAMP and cAMP-inhibited cGMP 3',5'-cyclic phosphodiesterase 10A
Type:Enzyme
Mol. Mass.:90160.88
Organism:Rattus norvegicus (rat)
Description:PDE10A was generated from the full-length recombinant rat clone transfected into Sf9 cells.
Residue:794
BDBM14743
BDBM10851
NameBDBM14743
Synonyms:(R)-4-[3-(2-Chloro-phenoxy)-pyrrolidin-1-yl]-6,7-dimethoxy-quinazoline 6,7-Dimethoxy-4-pyrrolidylquinazoline 6
TypeSmall organic molecule
Emp. Form.C20H20ClN3O3
Mol. Mass.385.844
SMILESCOc1cc2ncnc(N3CC[C@H](C3)Oc3ccccc3Cl)c2cc1OC