Reaction Details
TargetcAMP and cAMP-inhibited cGMP 3',5'-cyclic phosphodiesterase 10A
LigandBDBM14758
Substrate/CompetitorBDBM10851
Meas. Tech.PDE Competitive Enzyme Inhibition Assay
Ki 128±n/a nM
Citation Chappie, TAHumphrey, JMAllen, MPEstep, KGFox, CBLebel, LALiras, SMarr, ESMenniti, FSPandit, JSchmidt, CJTu, MWilliams, RDYang, FV Discovery of a series of 6,7-dimethoxy-4-pyrrolidylquinazoline PDE10A inhibitors. J Med Chem50:182-5 (2007) 
 
cAMP and cAMP-inhibited cGMP 3',5'-cyclic phosphodiesterase 10A
Name:cAMP and cAMP-inhibited cGMP 3',5'-cyclic phosphodiesterase 10A
Type:Enzyme
Mol. Mass.:90160.88
Organism:Rattus norvegicus (rat)
Description:PDE10A was generated from the full-length recombinant rat clone transfected into Sf9 cells.
Residue:794
BDBM14758
BDBM10851
NameBDBM14758
Synonyms:(R)-6,7-Dimethoxy-4-[3-(pyridin-3-yloxy)-pyrrolidin-1-yl]-quinazoline 6,7-dimethoxy-4-[(3R)-3-(pyridin-3-yloxy)pyrrolidin-1-yl]quinazoline
TypeSmall organic molecule
Emp. Form.C19H20N4O3
Mol. Mass.352.3871
SMILESCOc1cc2ncnc(N3CC[C@H](C3)Oc3cccnc3)c2cc1OC