Reaction Details
TargetcAMP and cAMP-inhibited cGMP 3',5'-cyclic phosphodiesterase 10A
LigandBDBM14763
Substrate/CompetitorBDBM10851
Meas. Tech.PDE Competitive Enzyme Inhibition Assay
Ki 17±n/a nM
Citation Chappie, TAHumphrey, JMAllen, MPEstep, KGFox, CBLebel, LALiras, SMarr, ESMenniti, FSPandit, JSchmidt, CJTu, MWilliams, RDYang, FV Discovery of a series of 6,7-dimethoxy-4-pyrrolidylquinazoline PDE10A inhibitors. J Med Chem50:182-5 (2007) 
 
cAMP and cAMP-inhibited cGMP 3',5'-cyclic phosphodiesterase 10A
Name:cAMP and cAMP-inhibited cGMP 3',5'-cyclic phosphodiesterase 10A
Type:Enzyme
Mol. Mass.:90160.88
Organism:Rattus norvegicus (rat)
Description:PDE10A was generated from the full-length recombinant rat clone transfected into Sf9 cells.
Residue:794
BDBM14763
BDBM10851
NameBDBM14763
Synonyms:(R)-6,7-Dimethoxy-4-[3-(7-methoxy-naphthalen-2-yloxy)-pyrrolidin-1-yl]-quinazoline 6,7-dimethoxy-4-[(3R)-3-[(7-methoxynaphthalen-2-yl)oxy]pyrrolidin-1-yl]quinazoline
TypeSmall organic molecule
Emp. Form.C25H25N3O4
Mol. Mass.431.4837
SMILESCOc1ccc2ccc(O[C@@H]3CCN(C3)c3ncnc4cc(OC)c(OC)cc34)cc2c1