Reaction Details
TargetcAMP and cAMP-inhibited cGMP 3',5'-cyclic phosphodiesterase 10A
LigandBDBM14765
Substrate/CompetitorBDBM10851
Meas. Tech.PDE Competitive Enzyme Inhibition Assay
Ki 18±n/a nM
Citation Chappie, TAHumphrey, JMAllen, MPEstep, KGFox, CBLebel, LALiras, SMarr, ESMenniti, FSPandit, JSchmidt, CJTu, MWilliams, RDYang, FV Discovery of a series of 6,7-dimethoxy-4-pyrrolidylquinazoline PDE10A inhibitors. J Med Chem50:182-5 (2007) 
 
cAMP and cAMP-inhibited cGMP 3',5'-cyclic phosphodiesterase 10A
Name:cAMP and cAMP-inhibited cGMP 3',5'-cyclic phosphodiesterase 10A
Type:Enzyme
Mol. Mass.:90160.88
Organism:Rattus norvegicus (rat)
Description:PDE10A was generated from the full-length recombinant rat clone transfected into Sf9 cells.
Residue:794
BDBM14765
BDBM10851
NameBDBM14765
Synonyms:(R)-6,7-Dimethoxy-4-[3-(2-methyl-quinolin-6-yloxy)-pyrrolidin-1-yl]-quinazoline 6,7-dimethoxy-4-[(3R)-3-[(2-methylquinolin-6-yl)oxy]pyrrolidin-1-yl]quinazoline
TypeSmall organic molecule
Emp. Form.C24H24N4O3
Mol. Mass.416.4724
SMILESCOc1cc2ncnc(N3CC[C@H](C3)Oc3ccc4nc(C)ccc4c3)c2cc1OC