Reaction Details
TargetcGMP-inhibited 3',5'-cyclic phosphodiesterase 3A
LigandBDBM14756
Substrate/CompetitorBDBM10851
Meas. Tech.PDE Competitive Enzyme Inhibition Assay
Ki 162±n/a nM
Citation Chappie, TAHumphrey, JMAllen, MPEstep, KGFox, CBLebel, LALiras, SMarr, ESMenniti, FSPandit, JSchmidt, CJTu, MWilliams, RDYang, FV Discovery of a series of 6,7-dimethoxy-4-pyrrolidylquinazoline PDE10A inhibitors. J Med Chem50:182-5 (2007) 
 
cGMP-inhibited 3',5'-cyclic phosphodiesterase 3A
Name:cGMP-inhibited 3',5'-cyclic phosphodiesterase 3A
Type:Enzyme
Mol. Mass.:124966.46
Organism:Homo sapiens (Human)
Description:Q14432
Residue:1141
BDBM14756
BDBM10851
NameBDBM14756
Synonyms:(R)-4-[3-(5-Chloro-pyrimidin-2-yloxy)-pyrrolidin-1-yl]-6,7-dimethoxy-quinazoline 6,7-Dimethoxy-4-pyrrolidylquinazoline 17
TypeSmall organic molecule
Emp. Form.C18H18ClN5O3
Mol. Mass.387.82
SMILESCOc1cc2ncnc(N3CC[C@H](C3)Oc3ncc(Cl)cn3)c2cc1OC