Reaction Details
TargetBromodomain-containing protein 4 [42-168]
LigandBDBM50365262
Substrate/Competitorn/a
Meas. Tech.In Vitro Enzyme Inhibition Assay-BRD4 Inhibition
IC50<500±n/a nM
Citation Bennett, MJBetancort, JMBoloor, AKanouni, TStafford, JAVeal, JMWallace, MB Therapeutic compounds US Patent US10202360 Publication Date 2/12/2019
 
Bromodomain-containing protein 4 [42-168]
Name:Bromodomain-containing protein 4 [42-168]
Type:Enzyme Catalytic Domain
Mol. Mass.:15054.68
Organism:Homo sapiens (Human)
Description:O60885[42-168]
Residue:127
BDBM50365262
NameBDBM50365262
Synonyms:(+)-JQ1 CHEMBL1957266 US10124009, Compound (S)-JQ1 US10308662, Compound JQ-1 US10617680, Example JQ-1 US10925881, Name (S)-JQ1 US11078188, Example (+)-JQ1 US11427593, Compound JQ1 US9320741, (S)-JQ1 | US9695172, JQ1
TypeSmall organic molecule
Emp. Form.C23H25ClN4O2S
Mol. Mass.456.988
SMILESCc1nnc2[C@H](CC(=O)OC(C)(C)C)N=C(c3c(C)c(C)sc3-n12)c1ccc(Cl)cc1