Reaction Details
TargetCREB-binding protein
LigandBDBM349497
Substrate/Competitorn/a
Meas. Tech.CBP TR-FRET Binding Assay
IC50 4.00±n/a nM
Citation Romero, FAMagnuson, SRPastor, RTsui, VHMurray, JCrawford, TBurdick, DJAlbrecht, BKCote, ATaylor, AMNasveschuck, CGLeBlanc, YHewitt, MCLai, KWChen, K Therapeutic compounds and uses thereof US Patent US10206931 Publication Date 2/19/2019
 
CREB-binding protein
Name:CREB-binding protein
Type:Transcription Coactivator
Mol. Mass.:265411.66
Organism:Homo sapiens (Human)
Description:Q92793
Residue:2442
BDBM349497
NameBDBM349497
Synonyms:(4R)-6-[7-(difluoromethyl)-6-(1-methylpyrazol-4-yl)-3,4-dihydro-2H-quinolin-1-yl]-4-methyl-1,3,4,5-tetrahydropyrido[3,4-b][1,4]diazepin-2-one | US10206931, Example 305
TypeSmall organic molecule
Emp. Form.C23H26F2N6O
Mol. Mass.440.4889
SMILESCN\C=C(/C=N)c1cc2CCCN(c2cc1C(F)F)c1nccc2NC(=O)C[C@@H](C)Nc12