Reaction Details
TargetSigma intracellular receptor 2
LigandBDBM349365
Substrate/Competitorn/a
Meas. Tech.Competitive Radioligand Binding Assay 2
Ki 5.00±n/a nM
Citation Rishton, GMCatalano, SMLook, GC Isoindoline compositions and methods for treating neurodegenerative disease US Patent US10207991 Publication Date 2/19/2019
 
Sigma intracellular receptor 2
Name:Sigma intracellular receptor 2
Type:Protein
Mol. Mass.:20857.20
Organism:Homo sapiens (Human)
Description:Q5BJF2
Residue:176
BDBM349365
NameBDBM349365
Synonyms:US10207991, Ex. Cpd. No. 10 US11691947, Example 10
TypeSmall organic molecule
Emp. Form.C19H19Cl2NO2
Mol. Mass.364.266
SMILESC[C@H](CCc1ccc(Cl)c(Cl)c1)N1Cc2cc3OCOc3cc2C1