Reaction Details
TargetSigma intracellular receptor 2
LigandBDBM349524
Substrate/Competitorn/a
Meas. Tech.Competitive Radioligand Binding Assay 2
Ki 8.90±n/a nM
Citation Rishton, GMCatalano, SMLook, GC Isoindoline compositions and methods for treating neurodegenerative disease US Patent US10207991 Publication Date 2/19/2019
 
Sigma intracellular receptor 2
Name:Sigma intracellular receptor 2
Type:Protein
Mol. Mass.:20857.20
Organism:Homo sapiens (Human)
Description:Q5BJF2
Residue:176
BDBM349524
NameBDBM349524
Synonyms:US10207991, Ex. Cpd. No. 40 US11691947, Example 40
TypeSmall organic molecule
Emp. Form.C25H33NO4
Mol. Mass.411.5338
SMILESCC(C)Oc1ccc(CC[C@@H](C)N2Cc3cc4OCOc4cc3C2)cc1OC(C)C