Reaction Details
TargetSigma intracellular receptor 2
LigandBDBM349526
Substrate/Competitorn/a
Meas. Tech.Competitive Radioligand Binding Assay 2
Ki 6.20±n/a nM
Citation Rishton, GMCatalano, SMLook, GC Isoindoline compositions and methods for treating neurodegenerative disease US Patent US10207991 Publication Date 2/19/2019
 
Sigma intracellular receptor 2
Name:Sigma intracellular receptor 2
Type:Protein
Mol. Mass.:20857.20
Organism:Homo sapiens (Human)
Description:Q5BJF2
Residue:176
BDBM349526
NameBDBM349526
Synonyms:US10207991, Ex. Cpd. No. 42 US11691947, Example 42
TypeSmall organic molecule
Emp. Form.C25H34FNO2
Mol. Mass.399.5414
SMILESCC(C)Oc1ccc(CCC(C)(C)N2Cc3ccc(F)cc3C2)cc1OC(C)C