Reaction Details
TargetSigma intracellular receptor 2
LigandBDBM349537
Substrate/Competitorn/a
Meas. Tech.Competitive Radioligand Binding Assay 2
Ki 17.0±n/a nM
Citation Rishton, GMCatalano, SMLook, GC Isoindoline compositions and methods for treating neurodegenerative disease US Patent US10207991 Publication Date 2/19/2019
 
Sigma intracellular receptor 2
Name:Sigma intracellular receptor 2
Type:Protein
Mol. Mass.:20857.20
Organism:Homo sapiens (Human)
Description:Q5BJF2
Residue:176
BDBM349537
NameBDBM349537
Synonyms:US10207991, Ex. Cpd. No. 53 US11691947, Example 53
TypeSmall organic molecule
Emp. Form.C20H24FNO2
Mol. Mass.329.4085
SMILESCOc1cc(CCC(C)(C)N2Cc3cccc(F)c3C2)ccc1O