Reaction Details
TargetIntermediate conductance calcium-activated potassium channel protein 4
LigandBDBM205030
Substrate/Competitorn/a
Meas. Tech.Inhibition Assay
pH7.3±n/a
IC50 16.0±0 nM
Commentsextracted
Citation Demnitz, JJorgensen, S Tetrazole derivatives and their use as potassium channel modulators US Patent US9556132 Publication Date 1/31/2017
 
Intermediate conductance calcium-activated potassium channel protein 4
Name:Intermediate conductance calcium-activated potassium channel protein 4
Type:PROTEIN
Mol. Mass.:47723.22
Organism:Homo sapiens (Human)
Description:ChEMBL_1361891
Residue:427
BDBM205030
NameBDBM205030
Synonyms:US9556132, 7 | process for preparing 2-(2-{2-[1-(2-fluorophenyl)-1h-1,2,3,4-tetrazol-5-yl]phenyl}phenoxy)acetonitrile
TypeSmall organic molecule
Emp. Form.C21H14FN5O
Mol. Mass.371.3672
SMILESFc1ccccc1-n1nnnc1-c1ccccc1-c1ccccc1OCC#N