Reaction Details
TargetcAMP-specific 3',5'-cyclic phosphodiesterase 4B [316-320,321-700,S319G,N320S,N321H,T322M]
LigandBDBM14361
Substrate/CompetitorBDBM10851
Meas. Tech.Phosphodiesterase (PDE) Inhibition Assay
IC50 570±n/a nM
Citation Card, GLEngland, BPSuzuki, YFong, DPowell, BLee, BLuu, CTabrizizad, MGillette, SIbrahim, PNArtis, DRBollag, GMilburn, MVKim, SHSchlessinger, JZhang, KY Structural basis for the activity of drugs that inhibit phosphodiesterases. Structure12:2233-47 (2004) 
 
cAMP-specific 3',5'-cyclic phosphodiesterase 4B [316-320,321-700,S319G,N320S,N321H,T322M]
Name:cAMP-specific 3',5'-cyclic phosphodiesterase 4B [316-320,321-700,S319G,N320S,N321H,T322M]
Type:Enzyme Catalytic Domain
Mol. Mass.:45579.64
Organism:Homo sapiens (Human)
Description:RECOMBINANT CATALYTIC DOMAIN OF HUMAN PHOSPHODIESTERASE 4B.
Residue:398
BDBM14361
BDBM10851
NameBDBM14361
Synonyms:(R,S)-Rolipram 4-[3-(cyclopentyloxy)-4-methoxyphenyl]pyrrolidin-2-one CHEMBL63 | Rolipram
TypeSmall organic molecule
Emp. Form.C16H21NO3
Mol. Mass.275.3428
SMILESCOc1ccc(cc1OC1CCCC1)C1CNC(=O)C1