Reaction Details
TargetcAMP-specific 3',5'-cyclic phosphodiesterase 7B [91-450]
LigandBDBM14773
Substrate/CompetitorBDBM10851
Meas. Tech.Phosphodiesterase (PDE) Inhibition Assay
IC50 44000±n/a nM
Citation Card, GLEngland, BPSuzuki, YFong, DPowell, BLee, BLuu, CTabrizizad, MGillette, SIbrahim, PNArtis, DRBollag, GMilburn, MVKim, SHSchlessinger, JZhang, KY Structural basis for the activity of drugs that inhibit phosphodiesterases. Structure12:2233-47 (2004) 
 
cAMP-specific 3',5'-cyclic phosphodiesterase 7B [91-450]
Name:cAMP-specific 3',5'-cyclic phosphodiesterase 7B [91-450]
Type:Enzyme Catalytic Domain
Mol. Mass.:41494.16
Organism:Homo sapiens (Human)
Description:Recombinant catalytic domain (Q91-P450) of human PDE7B.
Residue:360
BDBM14773
BDBM10851
NameBDBM14773
Synonyms:4-cyano-4-(3-cyclopentyloxy-4-methoxy-phenyl)cyclohexane-1-carboxylic acid Ariflo SB207499
TypeSmall organic molecule
Emp. Form.C20H25NO4
Mol. Mass.343.4168
SMILESCOc1ccc(cc1OC1CCCC1)C1(CCC(CC1)C(O)=O)C#N