Reaction Details
TargetHigh affinity cAMP-specific and IBMX-insensitive 3',5'-cyclic phosphodiesterase 8A
LigandBDBM14775
Substrate/CompetitorBDBM10851
Meas. Tech.Phosphodiesterase (PDE) Inhibition Assay
IC50>200000±n/a nM
Citation Card, GLEngland, BPSuzuki, YFong, DPowell, BLee, BLuu, CTabrizizad, MGillette, SIbrahim, PNArtis, DRBollag, GMilburn, MVKim, SHSchlessinger, JZhang, KY Structural basis for the activity of drugs that inhibit phosphodiesterases. Structure12:2233-47 (2004) 
 
High affinity cAMP-specific and IBMX-insensitive 3',5'-cyclic phosphodiesterase 8A
Name:High affinity cAMP-specific and IBMX-insensitive 3',5'-cyclic phosphodiesterase 8A
Type:Enzyme Catalytic Domain
Mol. Mass.:93295.89
Organism:Homo sapiens (Human)
Description:Recombinant catalytic domain (M1-E829) of human PDE8A.
Residue:829
BDBM14775
BDBM10851
NameBDBM14775
Synonyms:3-(cyclopentyloxy)-N-(3,5-dichloropyridin-4-yl)-4-methoxybenzamide CHEMBL42126 Piclamilast | RPR-73401
TypeSmall organic molecule
Emp. Form.C18H18Cl2N2O3
Mol. Mass.381.253
SMILESCOc1ccc(cc1OC1CCCC1)C(=O)Nc1c(Cl)cncc1Cl