Reaction Details
TargetHigh affinity cGMP-specific 3',5'-cyclic phosphodiesterase 9A [226-593]
LigandBDBM14775
Substrate/CompetitorBDBM14391
IC50>200000±n/a nM
Citation Card, GLEngland, BPSuzuki, YFong, DPowell, BLee, BLuu, CTabrizizad, MGillette, SIbrahim, PNArtis, DRBollag, GMilburn, MVKim, SHSchlessinger, JZhang, KY Structural basis for the activity of drugs that inhibit phosphodiesterases. Structure12:2233-47 (2004) 
 
High affinity cGMP-specific 3',5'-cyclic phosphodiesterase 9A [226-593]
Name:High affinity cGMP-specific 3',5'-cyclic phosphodiesterase 9A [226-593]
Type:Enzyme Catalytic Domain
Mol. Mass.:43183.20
Organism:Homo sapiens (Human)
Description:Recombinant catalytic domain (S226-A593) of human PDE9A.
Residue:368
BDBM14775
BDBM14391
NameBDBM14775
Synonyms:3-(cyclopentyloxy)-N-(3,5-dichloropyridin-4-yl)-4-methoxybenzamide CHEMBL42126 Piclamilast | RPR-73401
TypeSmall organic molecule
Emp. Form.C18H18Cl2N2O3
Mol. Mass.381.253
SMILESCOc1ccc(cc1OC1CCCC1)C(=O)Nc1c(Cl)cncc1Cl