Reaction Details
TargetAtypical chemokine receptor 3
LigandBDBM345948
Substrate/Competitorn/a
Meas. Tech.In Vitro Assay
EC50 1.000±n/a nM
Citation Guerry, PLehembre, FPothier, JSiendt, H CXCR7 receptor modulators US Patent US10202368 Publication Date 2/12/2019
 
Atypical chemokine receptor 3
Name:Atypical chemokine receptor 3
Type:Enzyme
Mol. Mass.:41498.84
Organism:Homo sapiens (Human)
Description:P25106
Residue:362
BDBM345948
NameBDBM345948
Synonyms:2-(3-Cyclopropylmethyl-2,3,4,5-tetrahydro-1H-benzo[d]azepin-6-yloxy)-N-(2-dimethylamino-ethyl)-N-(2-trifluoromethyl-benzyl)-acetamide | US10202368, Example 23
TypeSmall organic molecule
Emp. Form.C28H36F3N3O2
Mol. Mass.503.5995
SMILESCN(C)CCN(Cc1ccccc1C(F)(F)F)C(=O)COc1cccc2CCN(CC3CC3)CCc12