Reaction Details
TargetP2X purinoceptor 3
LigandBDBM319891
Substrate/Competitorn/a
Meas. Tech.Intracellular Calcium Measurement to Assess Antagonist Activity
IC50 4.00±n/a nM
Citation Davenport, AJBräuer, NFischer, OMRotgeri, ARottmann, ANeagoe, INagel, JGodinho-Coelho, AKlar, J 1,3-thiazol-2-yl substituted benzamides US Patent US10202369 Publication Date 2/12/2019
 
P2X purinoceptor 3
Name:P2X purinoceptor 3
Type:Protein
Mol. Mass.:44292.02
Organism:Homo sapiens (Human)
Description:P56373
Residue:397
BDBM319891
NameBDBM319891
Synonyms:3-(5-Methyl-1,3-thiazol-2-yl)-5-[(2S)-tetrahydrofuran-2-ylmethoxy]-N-{(1R)-1-[2-(trifluoromethyl)pyrimidin-5-yl]ethyl}benzamide US10202369, Example 58 | US10472354, Example 58
TypeSmall organic molecule
Emp. Form.C23H23F3N4O3S
Mol. Mass.492.514
SMILESC[C@@H](NC(=O)c1cc(OC[C@@H]2CCCO2)cc(c1)-c1ncc(C)s1)c1cnc(nc1)C(F)(F)F