Reaction Details
TargetP2X purinoceptor 3
LigandBDBM322397
Substrate/Competitorn/a
Meas. Tech.Intracellular Calcium Measurement to Assess Antagonist Activity
IC50 2.00±n/a nM
Citation Davenport, AJBräuer, NFischer, OMRotgeri, ARottmann, ANeagoe, INagel, JGodinho-Coelho, AKlar, J 1,3-thiazol-2-yl substituted benzamides US Patent US10202369 Publication Date 2/12/2019
 
P2X purinoceptor 3
Name:P2X purinoceptor 3
Type:Protein
Mol. Mass.:44292.02
Organism:Homo sapiens (Human)
Description:P56373
Residue:397
BDBM322397
NameBDBM322397
Synonyms:US10183937, Example 208 US10472354, Example 207
TypeSmall organic molecule
Emp. Form.C24H23F6N5O2S
Mol. Mass.559.527
SMILESC[C@H](NC(=O)c1cc(OC2CCNC(C2)C(F)(F)F)cc(c1)-c1ncc(C)s1)c1cnc(nc1)C(F)(F)F