Reaction Details
TargetP2X purinoceptor 2/3
LigandBDBM320137
Substrate/Competitorn/a
Meas. Tech.Intracellular Calcium Measurement to Assess Antagonist Activity
IC50 27.0±n/a nM
Citation Davenport, AJBräuer, NFischer, OMRotgeri, ARottmann, ANeagoe, INagel, JGodinho-Coelho, AKlar, J 1,3-thiazol-2-yl substituted benzamides US Patent US10202369 Publication Date 2/12/2019
 
P2X purinoceptor 2/3
Name:P2X purinoceptor 2/3
Type:Protein
Mol. Mass.:n/a
Description:n/a
Components:This complex has 2 components.
Component 1
Name:P2X purinoceptor 2
Synonyms:ATP receptor P2RX2_HUMAN Purinergic receptor | PurinergicP2X2/3
Type:Enzyme Catalytic Domain
Mol. Mass.:51765.18
Organism:Homo sapiens (Human)
Description:PurinergicP2X2/3 0 HUMAN::Q9UBL9
Residue:471
Component 2
Name:P2X purinoceptor 3
Synonyms:ATP receptor P2RX3 P2X purinoceptor 3 P2X purinoceptor 3 (P2X3) P2X3 purinoceptor p2x3 + hsa
Type:Protein
Mol. Mass.:44292.02
Organism:Homo sapiens (Human)
Description:P56373
Residue:397
BDBM320137
NameBDBM320137
Synonyms:3-{[1-(2,2- difluoroethyl) piperidin-4-yl]oxy}- 5-(5-methyl-1,3- thiazol-2-yl)-N- {(1R)-1-[2- (trifluoroethyl) pyrimidin-5- yl]ethyl}benzamide US10202369, Example 308 | US10472354, Example 304
TypeSmall organic molecule
Emp. Form.C25H26F5N5O2S
Mol. Mass.555.563
SMILESC[C@@H](NC(=O)c1cc(OC2CCN(CC(F)F)CC2)cc(c1)-c1ncc(C)s1)c1cnc(nc1)C(F)(F)F